RECOMMENDED: If you have Windows errors then we strongly recommend that you download and run this (Windows) Repair Tool.

c – gcc gdb building – "lvalue required as increment operand" on. – Jan 16, 2014. And the post-increment operator requires an lvalue. The (*((void **)__o-> next_free))++ version will not have the lvalue error and will compile.

It looks like replacing line 662 of read-rtl.c with > > obstack_ptr_grow. error: lvalue required as increment operand > >././gcc-3.2.3/gcc/read-rtl.c:662.

Error Code 2908 Visual Studio 2005 This article will showcase a scenario where Razor Pages is used to produce a small e-commerce website, also with a help from Facebook’s React / ReactJS.NET to. msdn.com/astebner/archive/2005/06/17/430320.aspx. MSI returned error. install+Visual+Studio+2008+Error+code+. error I get with Visual. Taskmon Exe Error RegSvr.exe is not essential for Windows 10/8/7/XP and will often cause problems. Click here
Taskmon Exe Error RegSvr.exe is not essential for Windows 10/8/7/XP and will often cause problems. Click here to see what RegSvr is doing, and how to remove RegSvr.exe. Winternals Recovery Manager saves us from certain Mydoom – Then it copies itself to the hard disk, showing up only as a Notepad file. After that it might copy itself

Read-rtl. C662 Error Lvalue Required As Increment Operand. Tashirosgt28th July 2005, 02:18 PMGive a link to to clear all LQ-related cookies. Note that this means.

Htc Error Code 0x80072f17 ActiveSync error 0x80072F17 – 13.Sep.2007 1:21:47 AM damiancullen. Posts: 3 Joined: 13.Sep.2007 Status: offline: HI Guys, Ive recently installed Exchange 2007. Error Binding To Socket On Local Address Failed int zmq_bind (void *socket, const char *endpoint);. ipc: local inter-process communication transport, see zmq_ipc(7); tcp: unicast transport using TCP, assert (socket); /* Bind it to a

I am just trying to understand the pointers concept in C and came across this error. I got the "lvalue required as increment operand" error for the following code.

[SOLVED] Installing gcc 3.2 make errors – LinuxQuestions – gcc-3.2/gcc/read-rtl.c:662: error: lvalue required as increment operand make[1]: *** [read-rtl.o] Error 1 make[1]: Leaving directory.

Andrew Haley – Re: cannot build gcc 3.2.3 in Suse 10.3 (gcc 4.2.1) – Jan 5, 2008. gcc-3.2.3/gcc/read-rtl.c: In function 'read_rtx': > >././gcc-3.2.3/gcc/read-rtl.c:662: error: lvalue required as increment operand > >./.

So I want to know what is lvalue and how can I fix. error: lvalue required as increment operand. [GCC/gcc/CMakeFiles/genconstants.dir/read-rtl.o] Error 1.

. How to resolve error "lvalue required as increment operand. I got an error./gcc-build/gcc-3.2/gcc/read-rtl. It seems that gcc has disallowed cast-as-lvalue.

RECOMMENDED: Click here to fix Windows errors and improve system performance

Categories: Article