RECOMMENDED: If you have Windows errors then we strongly recommend that you download and run this (Windows) Repair Tool.

Mexico’s registered political parties get on the ballot automatically. But the app bogs down with error messages, and the video shows her — supposedly a half.

MFC DLL ON_REGISTERED_MESSAGE. error C2440: 'static_cast. From the error message you have provided it looks like you are trying to use the CRedDllApp as a.

Pppoe Error 651 May 07, 2014  · http://www.fixpczone.com Error 651 is easy to fix with registry cleaner. If you scan your computer it will detect all the errors in your registry and. Error 651 is a common windows error which usually occurs when we try to establish internet connection using PPPoE connections. This error occurs due to. Connecting through

CNU interviewed more than 500 registered voters across the state. The results.

I am converting my project from a 32 bit version to 64 bit version, when compiling the project in 64 bit, i get the below error. Error 2 error C2440: 'static_cast.

Nov 5, 2009. You must register before you can post. Page 1 of 2 12. the following error: 1>e: developmentglm-0.8.4.0glmcoretype_half.inl(249) : error C2440: '<function- style-cast>' : cannot convert from 'const RenderTools::Vector3' to 'float'. The error message is weard. you can't cast a vec3 to a float. This is even.

error C2440: 'static_cast' : cannot convert from 'void. > The error message is very clear. >. ON_REGISTERED_THREAD_MESSAGE.

Serial communications is needed in several types of applications, but the Win32 API isn’t a very easy to use API to implement it. Things get even more complicated.

But the Caldecott Medal, the premier American award for picture books, registered a note of dissent. But when the Virgin appears and revives the little tumbler,

. generates a compiler error: error C2440: 'type cast' : cannot convert from. Something that should work is listed below. when you want to read which new message has happened today while i programmed my program.

This summarizes a number of errors and omissions in the MSDN documentation. Do you know of one? I’ll add it here, and even give you credit for it.

Error: operator() will not be called for implicit or explicit. – Oct 20, 2015. 1>ConsoleApplication3.cpp(50): error C2440: 'initializing' : cannot. 107, Wrong /bad warning message from ICC, good warning from MS.

For one of my previous projects, I needed to display a continuous flow of data on a charting control. I decided to develop my own control because I couldn’t find any.

Aug 24, 2013. register the window class. return this part of the WM_QUIT message to Windows. Error 1 error C2440: '=' : cannot convert from 'const wchar_t [13]' to ' LPCSTR' c:usersmichaeldocumentsvisual studio 2012projectsmy.

So from now on, users who will try accessing the service via their gaming.

Ruby Gem File Permission Error For Harvest Moon: Friends of Mineral Town on the Game Boy Advance, FAQ/Walkthrough by samurai goroh. Fluentd uses MessagePack for all internal data representation. It’s crazy fast because of zero-copy optimization of msgpack-ruby. Now MessagePack is an essential. Feb 26, 2013. Ruby gem problems around libv8, therubyracer, mac vs. linux, native. to write to the

On Registered Message Error C2440. Forum Visual C++ & C++ Programming Visual C++ Programming error C2440: 'static_cast' : cannot convert from 'LRESULT (__thiscall.

Compiler Error C2440. Visual Studio 2015. on lines 15 and 16 of the next sample are qualified with the Incompatible calling conventions for UDT return value message.

May 31, 2011. 4.7 Compile Error: Instantiate.h : error C2440: '<function-style-cast>. 5.5 I get the message "ValueError: Python object not a Field type. visual display and correct co-location and co-registration of haptics and graphics.

ON_REGISTERED_THREAD_MESSAGE compile error. The compile error that I get is: Error 1 error C2440:. whether you use ON_REGISTERED_MESSAGE or ON_REGISTERED.

And besides, regardless of how the error occurred, it can be easily rectified. All.

(translated) error message: // error C2440: '=': 'void (__thiscall A::* )(int,const char *)' could not be converted to 'fp'. } private:. Is this some kind of callback mechanism and you want to register object's method ? Last edited by.

I have a code from TT-Exchange but it is not recognised on the application page. The error message asks me to check with TT Exchange but the code is definitely correct. (I used it to open an Adwords account yesterday)

RECOMMENDED: Click here to fix Windows errors and improve system performance

Categories: Article