RECOMMENDED: If you have Windows errors then we strongly recommend that you download and run this (Windows) Repair Tool.

TestNG Tutorial: In this tutorial, we would discuss all about TestNG, its features and its applications. TestNG is an advance framework designed in a way to leverage.

Apr 30, 2014. Subject, Re: Log4J – "cannot find symbol – method trace(String)". Check with maven copy dependencies and a grep over the contents of all > the jar files. Logger > >>> >> > >>> >> This error message does not make much.

Oracle Error 1157 The Driver Detected A Controller Error On Device Harddisk4 Dr4 hard drive – The driver detected a controller error on Device. – May 29, 2016. It clearly says which disk it is. DeviceHarddisk 1 DR3, so it is referring to Disk 1. The DR3 part at the end is some kind of identifaction to which.

You can find the. throw compile error. Right now we are limited to "ES5" (current JS standard) features because all browsers are not completely compatible right.

Oh Man, You’re Gonna Hate What Equifax Just. – Gizmodo – Equifax, the major credit reporting agency which collected extensive financial data on hundreds of millions of Americans before losing said data on 143 million of.

The Tiangong-1 or “Heavenly Palace” lab was launched in 2011 and described as a “potent political symbol” of China. he’ll Need to Find a Way to Pay for it Last.

Feb 23, 2015. What I've noticed (using Oracle Java 1.6.0_65 and Maven 3.2.1) is the. cannot find symbol. [ERROR] location: class hudson.plugins.claim.

Maven: cannot find symbol build error. Hello, I am trying to use Maven (2.0.7) to build an application on an Intel Mac (OSX 10.4.10). It keeps failing with 'cannot.

The Driver Detected A Controller Error On Device Harddisk4 Dr4 hard drive – The driver detected a controller error on Device. – May 29, 2016. It clearly says which disk it is. DeviceHarddisk 1 DR3, so it is referring to Disk 1. The DR3 part at the end is some kind of identifaction to which. Our software tests controller, seek, and surface. Dec 21, 2011.

cannot find symbol. Hi, I've encountered a strange error executing "mvn compile", as follows: [DEBUG].

We therefore cannot. might find the real-world rate different enough to preclude profitable action. Professor Fischer has published another paper[7] in the time that it has taken to me to write this second part. In this paper, he makes an.

Nov 18, 2016. [ERROR] /home/forge/graphhopper/core/src/main/java/com/graphhopper/coll/ IntDoubleBinHeap.java:[23,38] error: cannot find symbol

Mar 15, 2016. Using Lombok 1.16 with Netbeans 8.1 and Maven. 2 Replies. com/illucit/ lomboktest/Main.java:[8,25] error: cannot find symbol.

Maven clean install: cannot find symbol. Ask Question. up vote 2 down vote favorite. 1. Hibernate using Maven Compile Error. 0. maven compile failure, cannot access.

I have a preference for the shopping experience Target provides in comparison to Wal-Mart (WMT), but I find myself in Wal-Mart far more often. there closely didn’t have to be a retail maven to view Target’s efforts as amateurish, at best.

FEBRUARY 2017. Jon Lackman conducted this email interview with Forrest for a publication that did not use it. Rather than let it die in his computer Jon has decided.

[ERROR] /home/user/git/zimbra-foss/SolrPlugins/src/java/com/zimbra/solr/ AddrCharTokenizer.java:[58,31] cannot find symbol [ERROR] symbol:.

maven "cannot find symbol" message. error: cannot find symbol. Maven compile "Cannot find symbol" with library from repository but work with explicit.

RECOMMENDED: Click here to fix Windows errors and improve system performance

Categories: Article