Arduino Tutorial - Install and Use Arduino Libraries (No Such File or Directory)

RECOMMENDED: If you have Windows errors then we strongly recommend that you download and run this (Windows) Repair Tool.

Install CERN ROOT on Ubuntu 9.10 | Rakitha's Blog – Feb 2, 2010. Checkout the version into this location svn co 26-00a root.5.26a where root.5.26a is the directory root to be install. 4. fftw3, gdml, genvector, ldap, mathmore, memstat, minuit2, mysql, odbc, opengl, python, reflex, roofit, shadowpw, shared, ssl, table, tmva, xft, xml, xrootd. 6.

In file included from drw.c:6:0: /usr/include/X11/Xft/Xft.h:39:22: fatal error: ft2build.h: No such file or directory #include <ft2build.h>.

Pristontale Error Priston Tale – RaGEZONE – MMO development community – Priston Tale – Discuss Priston Tale server development here. Okay guys, Here's the problem: Ideas on the problem? Bump: I have done the following: Run as. PristonTale 2: The 2nd Enigma, Caeldome. 17,448 likes · 1,410 talking about this. Priston Tale 2 Free to play

You must then provide the short name for the working directory in the R Services configuration file. To enable 8dot3 notation. the following message as part of the STDERR message: Fatal error: creation of tmpfile failed. This error.

Oct 21, 2013. Errors compiling on OS X 10.9 I had no problems compiling on OS X previous to installing 10.9. But after. /usr/X11R6/include Checking for X11/Xft/Xft.h. cint/ cint/lib/gcc4strm/iostrm.h:85:17: error: no type named '__streambuf_type' in 'std:: __1::basic_ostream<char>' static ostream::__streambuf_type.

Aviation Week & Space Technology – Use of prescription drugs, known to impair judgment and mental acuity, also was a factor in a significant number of single turboprop fatal. group such honest mistakes with deliberate criminal wrongdoing. While the individual who.

#1 2012-10-19 22:48:39 cortman #! Ft2build.h: No Such File Or Directory Open your XFT-patched dwm.c and the systray patch in an editor;3. Thanks for your help and for making your patches available!

swaroop.pal101088 2012-01-23 06:11:41 UTC #9. how to solve the error its not working even by changing to sudo. and when i try to run the make file i get this error fatal error: avformat.h: No such file or directory.

2015年8月6日. 将qt-x11-opensource-src-4.5.0/bin 下生成的qvfb 文件copy 至/usr/local/Trolltech/ QtEmbedded-4.5.0-x86/bin 下. 四. configure –prefix=/usr/local/tslib –host=arm- linux –cache-file=arm-linux.cache –enable-inputapi=no. 4、videocaptureview. cpp:54:28: fatal error: linux/videodev.h: No such file or directory.

Installing libc6 and libc6-dev solved it for me: Sudo apt-get install libc6 libc6-dev. I had also found some reference for it, but sadly i lost it.

Mark Macpherson said no one told him how long his mother was alone in the room; he assumed it was shorter than 20 minutes. “That’s absurd,” he said. “That’s disgusting.” As part of their efforts to ensure such an error doesn’t take.

such file or directory compilation terminated. make[2]: *** [som_pak_wrap.o] Error 1 make[2]: Leaving directory Any information you use, you are using at your own risk. I am in no way liable for any loss, damage of data, hardware or anything else in connection with the use of this website.

It is implemented entirely in C and has no dependencies beyond a standard C library. It is embeddable and extensible with plug-ins. It supports on-the-fly configuration by reading files or strings TLS/SSL (via GNUTLS or OpenSSL) virtual hosts authentication cache friendly features PHP custom error management and much.

which includes a fatal filename within it. For example, a web address calling for an image file named C:$MFTBummer. would start the crash. The Chrome web browser, however, will block such an attack because it won’t load images.

994255, bcmwl-kernel-source bcmwl kernel module failed to build [fatal error: asm/system.h: No such file or directory], bcmwl, High. 990635, Sans serif cyrrilic font in kubuntu 12.04 is bad, qt4-x11, Undecided, Confirmed, This patch fixes bad cyrillic 'sans-serif' and 'serif' BUT is not tested. fatal error: gdk-pixbuf-xlib/gdk-pixbuf-xlib.h: No such file or directory compilation terminated. make[1]: *** [yimage.o] Error 1 make[1]: *** Waiting for unfinished jobs. make[1]: Leaving directory `/var/tmp/portage/x11- wm/icewm-1.3.7-r1/work/icewm-1.3.7/src' make: *** [base] Error 2 [31;01m*.

RECOMMENDED: Click here to fix Windows errors and improve system performance

Categories: Article