CppCon 2017: Herb Sutter “Meta: Thoughts on generative C++”

RECOMMENDED: If you have Windows errors then we strongly recommend that you download and run this (Windows) Repair Tool.

The compiler error says: type `class Vector<SomeClass>' argument given to `delete', expected pointer What expected pointer? Answers.

The compiler error says: type `class Vector<SomeClass>' argument given to `delete', expected pointer. It's not saying "expected" pointer was given to delete.

Error In Java Launcher And yes, startup has 1 dash and launcher.library has 2. /sigh Edit: it looks like by default Eclipse does come with these options. I somehow managed to lose them, so this is probably my fault. The error couldn’t be more cryptic though. Lesabre Tcc Error Solidworks Security Device Error Error Code 0192 SEVENTY mental health

. 'class xercesc_3_1::DOMImplementationLS' has no member named ' createDOMWriter' DomSerializer.cpp:207: error: type '<type error>' argument given to 'delete', expected pointer make[2]: *** [DomSerializer.lo] Error 1 make[2]: Leaving directory `/usr/src/oreka-svn/orkbasecxx/serializers' make[1]: *** [all- recursive] Error.

Cause: An invalid index was specified in a call to bind_array of dbms_sql. The index may have been null or of an improper value.

Sep 30, 2017. Specifically, it tests whether the loop ended by finding end-of-file (if not, you didn't get input of the expected type/format). class Empty { }; void f() { Empty a, b; if ( &a == &b) cout << "impossible: report error to compiler supplier"; Empty* p1 = new Empty; Empty* p2 = new Empty;. Given that, we can write

A comprehensive list of defect corrections for major releases, refresh packs and fix packs of Cognos Business Intelligence 10.2.1. Details of the APARs listed below.

While a trustee’s son might be expected to receive favorable treatment. In 2016, FIRE, which had been connecting accused students with lawyers and offering a.

Sep 4, 2017. error: uninitialized const 'd' [-fpermissive], note: 'const class D' has no user- provided default constructor; error: there are no arguments to 'f' that depend on a template. warning: passing argument %d of %D from incompatible pointer type; note: expected 'const char **' but argument is of type 'char **'.

Nov 27, 2017. assignment: regular types – prefer initialization – copy – move – other operations – default; class : data – invariant – members – helpers – concrete types. loop variable type ??? function: naming – single operation – no throw – arguments – argument passing – multiple return values – pointers – lambdas.

A thousand years from now, the twentieth century will be remembered as the time when we discovered quantum mechanics. Forget wars, computers, bombs, cars and airplanes: quantum mechanics is a deep truth that will continue.

Compiler error trying to delete template type. type 'int' argument given to 'delete', expected. the user of the class use smart pointers.

User manual and reference guide version 5.32.1. CodeMirror is a code-editor component that can be embedded in Web pages. The core library provides only the editor.

Reliability of Wikipedia – Wikipedia – The reliability of Wikipedia (predominantly of the English-language edition) has been frequently questioned and often assessed. The reliability has been tested.

RECOMMENDED: Click here to fix Windows errors and improve system performance

Categories: Article