RECOMMENDED: If you have Windows errors then we strongly recommend that you download and run this (Windows) Repair Tool.

Grab either from any GNU archive site. make[3]: *** [bfd.info] Error 1 make[3]: Leaving directory `/mnt/lfs/sources/binutils-build/bfd/doc' Making info in po make mnt/lfs/sources/binutils-build/bfd'. Дописал параметры в конфигурацию, потом снова make и новые ошибки.

./configure –prefix=$PREFIX –target=avr –disable-nls. But when I run make I get the following errors on makeinfo shown below. I Googled a bit and discovered this thread. Grab either from any GNU archive site. make[3]: *** [bfd.info] Error 1 make[3]: Leaving directory.

When a weak defined symbol is linked with a normal defined symbol, the normal defined symbol is used with no error. When a weak undefined symbol is linked and the symbol is not defined, the value of the weak symbol becomes zero.

Grab either from any GNU archive site. > make[3]: *** [bfd.info] Error 1 > make[3]: Leaving directory `/mnt/lfs/sources/binutils-build/bfd/doc' > Making info in po > make[3]… #14302 closed defect (obsolete). make bfd.info fail.

[SOLVED] Make error in compiling binutils | Forum –.325: unknown command `colophon'./././binutils-2.23.2/bfd/doc/bfd.texinfo:336: unknown command `cygnus' make[3]: *** [bfd.info] Error 1 make[3]: Leaving directory `/mnt/lfs/sources/binutils-build/bfd/doc' Making info in po make[3].

Aug 25, 2014. Below is the error: [email protected] build]$ gcc –version gcc (GCC). for target ' bfd.info' failed make[6]: *** [bfd.info] Error 1 make[6]: Leaving.

buildroot binutils-2.17 compile error | Forum – Grab either from any GNU archive site. make[4]: *** [/usr/arm/buildroot-atmel/toolchain_build_arm_small/binutils-2.17/bfd/doc/bfd.info] Error 1 make[4]: Leaving directory.

propgcc/binutils/bfd/doc/bfd.texinfo:336: unknown command `cygnus' make[3]: *** [bfd.info] Error 1 make[2]: *** [info-recursive] Error 1 make[1]:.

Linux kernel 3.14.6 is now the most advanced version of the. a KCS timeout that occurred during error recovery has been reset, win8 OSI has been blacklisted for Dell Inspiron 7737, 64-bit builds now work with binutils 2.24, and the.

Fatal Error Call To Undefined Function Int. posted 2 years ago. Installation. PHP Fatal error: Call to undefined method IlluminateFoundationApplication::getCachedCompilePath() in. ereeur qui s'affiche sans cesse : Fatal error: Call to undefined function nom_utilisateur() in /web/users/l1242422/PHP/user_list.php on line 4 I am trying to call a function from another function. I get an error: Fatal error: Call to undefined function getInitialInformation()

#14302 (make bfd.info fail) – OpenWrt – Compiling last atheros kamikaze revision make proce's stops on bfd.info. / atheros/build_dir/toolchain-mips_gcc4.1.2/binutils-2.18/bfd/doc' make[8]: `chew' is up. section level of @subsubsection which is too low make[7]: *** [bfd.info] Error 1.

Apr 24, 2009. Grab either from any GNU archive site. make[3]: *** [bfd.info] Error make[3]:. `/ home/meena/binutils-2.19/build/bfd' make[1]: *** [all-bfd] Error 2.

Sep 11, 2013. Grab either from any GNU archive site. make[3]: *** [bfd.info] Error 1 make[3]: Leaving directory `/mnt/lfs/sources/binutils-build/bfd/doc' Making.

Telstra Connection Error 26 TPG FTTB Plans – Bundle and Save | TPG website – TPG Voice Service is delivered using voice over Internet Protocol (VoIP). The Voice Service supports fax to national numbers in the Telstra, Optus, AAPT and Primus. Telstra’s first network outage in February – which affected about 15 per cent of the group’s customers because

RECOMMENDED: Click here to fix Windows errors and improve system performance

Categories: Article