RECOMMENDED: If you have Windows errors then we strongly recommend that you download and run this (Windows) Repair Tool.

Ordinal 5360 Error For Fallout 3: Game of the Year Edition on the PC, a GameFAQs Answers question titled "The ordinal 5360 could not be located in the dynamic link library. For Fallout 3 on the PC, a GameFAQs message board topic titled "Ordinal Error 5360". Fallout 3 & Windows 8 – The ordinal 5359 could not be

15 Stonewall Terrace, Atkinson, NH 03811 – MLS 4648759. – Jul 22, 2017. Average travel time to work for people in this community: 29. Closest Major Sports. no-photo · 45 Sandra's Run, Dover, NH 03820. $379,900.

BHG, Big Hearted Guy. BHL8, Be. CWOT, Complete Waste Of Time. DARFC, Ducking And Running For Cover. FE, Fatal Error. RTS, Read The Screen.

BHG RTS run time error :: Rise of Nations: Extended Edition. – Getting the "BHG RTS run time Fatal" message when i press play. It says "Could not initialize DirectX! Please make sure your system supports Direct X 10 or higher.

Dec 31, 2014. Still, my love affair with a good boiled peanut runs deep and true. Since these were pre-made and Ready to Ship (RTS) the turn around time.

I've seen one other thread about this problem but it died before anyone posted a solution. Running RoN on Windows 7 using Intel HD 4600 graphics (yes on the latest.

Fake News Papers Fake News Videos. A Few Abbreviations.

Error Code 615 Lock Poker Aristocrat Leisure Limited is an ASX100 listed company and one of the largest manufacturers of gaming solutions and poker machines in the world. error code, starting, crankshaft, pilot jet, reverse, idle, motor, troubleshooting, rod, illustration, operation, rear, bars, charge, carb, workshop, magneto, error codes, cooler, torque specs, cover, compression ratio, oversized, guide, jug, +*Discount Code+
Configure Error No Curses/termcap Library Found Centos 编译Mysql时configure: error: No curses/termcap library found 的错误. – 2009年9月6日. 编译Mysql时configure: error: No curses/termcap library found 的错误解决方法. 在 编译Mysql时./configure –prefix=DIR. ,如果出现了以下错误:. CentOS – Compile mutt error: configure: error: no curses. – I am trying to compile mutt from source so that I can enable debugging. When I run./configure –enable-debug I get: configure: error: no curses This

NetLingo List of Chat Acronyms & Text Shorthand – NetLingo List of Chat Acronyms & Text Shorthand. Acronyms have always been an integral part of computer culture, and they have since spawned a new language on the.

RTs Nationwide Help Houston Recovery Efforts. Written by Christina Johnson. Rebuilding Together Houston is back up and running. They are fully engaged.

Quickly adapt to evolving test requirements of wireless devices; Shorten test times with hardware-accelerated power measurements, rapid display updates and.

MSXML_Error_Problem.docI'm new to this forum and hope I attached my document properly. Someone please let me know if it works otherwise I'll retype it.

View Homework Help – ACC 556 Week 5 Midterm Exam – Strayer NEW from ACCT 101 at Ashworth College. ACC 556 Week 5 Midterm Exam – Strayer NEW.

experimentally at California ╠═╬╧ in a series of test runs. Keywords:. PF0 rts § (1. W. └ §. parameters are constant or slowly time varying during. to achieve z ero steady state error during curve ridingcG. 9. bhg q being the P – gainsuQ 1andvQГf of the initial control design ( 11) , and the time constants p s andwp └.

RECOMMENDED: Click here to fix Windows errors and improve system performance

Categories: Article